{"text_format":"1","workbook":"xlsx","n_sheets":2,"sheets":["lomake","ryhmät"],"not_rendered":{"charts":0,"images":0,"macros":1,"external_links":0,"defined_names":1,"comments":0,"pivot_tables":0},"unopened":[],"bounds":{"document_bytes":16777216,"sheet_cells":100000,"rows_first":2000,"rows_last":500,"rows_between":2000,"halvings":0,"cell_chars":16384,"cell_head_chars":4096},"cells_cut":0,"cells_raw":0,"read":"whole","date_system":"1900"}

{"sheet":"lomake","index":0,"n_rows":126,"n_cols":13,"rows_kept":126,"cut":false,"hidden":false,"merged":[]}
[null,null,"Kysely päiväkotien ryhmätietojen keräämiseksi (2017 syntyneet)"]
[]
[null,null,"1. Valitse ensin päiväkotisi"]
[]
[null,null,"Valitse tästä (alasvetovalikko)"]
[null,null,{"$f":"IF(C5=\"Valitse tästä (alasvetovalikko)\", \"ET OLE VALINNUT VIELÄ PÄIVÄKOTIASI\",\"\")","v":"ET OLE VALINNUT VIELÄ PÄIVÄKOTIASI"}]
[]
[]
[null,null,"2. Valitse esitäytettyjen ryhmien opettajien määrä"]
[null,null,{"$f":"IF(AND(C5<>\"Valitse tästä (alasvetovalikko)\",C12:C22=\"\"),\"EI ESITÄYTETTYJÄ RYHMIÄ, SIIRRY KOHTAAN 4\",\"\")","v":""}]
[null,null,"Ryhmän nimi","Opettajien lukumäärä ryhmässä"]
[2,null,{"$f":"IF(VLOOKUP($C$5,ryhmät!$A$2:$L$2000,$A12,FALSE)=0,\"\",VLOOKUP(lomake!$C$5,ryhmät!$A$2:$L$2000,$A12,FALSE))","v":""}]
[3,null,{"$f":"IF(VLOOKUP($C$5,ryhmät!$A$2:$L$2000,$A13,FALSE)=0,\"\",VLOOKUP(lomake!$C$5,ryhmät!$A$2:$L$2000,$A13,FALSE))","v":""}]
[4,null,{"$f":"IF(VLOOKUP($C$5,ryhmät!$A$2:$L$2000,$A14,FALSE)=0,\"\",VLOOKUP(lomake!$C$5,ryhmät!$A$2:$L$2000,$A14,FALSE))","v":""}]
[5,null,{"$f":"IF(VLOOKUP($C$5,ryhmät!$A$2:$L$2000,$A15,FALSE)=0,\"\",VLOOKUP(lomake!$C$5,ryhmät!$A$2:$L$2000,$A15,FALSE))","v":""}]
[6,null,{"$f":"IF(VLOOKUP($C$5,ryhmät!$A$2:$L$2000,$A16,FALSE)=0,\"\",VLOOKUP(lomake!$C$5,ryhmät!$A$2:$L$2000,$A16,FALSE))","v":""}]
[7,null,{"$f":"IF(VLOOKUP($C$5,ryhmät!$A$2:$L$2000,$A17,FALSE)=0,\"\",VLOOKUP(lomake!$C$5,ryhmät!$A$2:$L$2000,$A17,FALSE))","v":""}]
[8,null,{"$f":"IF(VLOOKUP($C$5,ryhmät!$A$2:$L$2000,$A18,FALSE)=0,\"\",VLOOKUP(lomake!$C$5,ryhmät!$A$2:$L$2000,$A18,FALSE))","v":""}]
[9,null,{"$f":"IF(VLOOKUP($C$5,ryhmät!$A$2:$L$2000,$A19,FALSE)=0,\"\",VLOOKUP(lomake!$C$5,ryhmät!$A$2:$L$2000,$A19,FALSE))","v":""}]
[10,null,{"$f":"IF(VLOOKUP($C$5,ryhmät!$A$2:$L$2000,$A20,FALSE)=0,\"\",VLOOKUP(lomake!$C$5,ryhmät!$A$2:$L$2000,$A20,FALSE))","v":""}]
[11,null,{"$f":"IF(VLOOKUP($C$5,ryhmät!$A$2:$L$2000,$A21,FALSE)=0,\"\",VLOOKUP(lomake!$C$5,ryhmät!$A$2:$L$2000,$A21,FALSE))","v":""}]
[12,null,{"$f":"IF(VLOOKUP($C$5,ryhmät!$A$2:$L$2000,$A22,FALSE)=0,\"\",VLOOKUP(lomake!$C$5,ryhmät!$A$2:$L$2000,$A22,FALSE))","v":""}]
[]
[null,null,"3. Täytä esitäytettyjen ryhmien muut tiedot"]
[null,null,{"$f":"\"Ryhmä: \"&C12","v":"Ryhmä: "}]
[null,null,"Opettajan etunimi","Opettajan sukunimi","Opettajan henkilötunnus","Opettajan muodollinen pätevyys","Aikuisten määrä","Ryhmän ikäluokat","Ryhmän koko","Vuorohoitoryhmä","Integroitu erityisryhmä","Osa-aikaiset lapset","Kommentti"]
[]
[]
[]
[]
[null,null,{"$f":"\"Ryhmä: \"&C13","v":"Ryhmä: "}]
[null,null,"Opettajan etunimi","Opettajan sukunimi","Opettajan henkilötunnus","Opettajan muodollinen pätevyys","Aikuisten määrä","Ryhmän ikäluokat","Ryhmän koko","Vuorohoitoryhmä","Integroitu erityisryhmä","Osa-aikaiset lapset","Kommentti"]
[]
[]
[]
[]
[null,null,{"$f":"\"Ryhmä: \"&C14","v":"Ryhmä: "}]
[null,null,"Opettajan etunimi","Opettajan sukunimi","Opettajan henkilötunnus","Opettajan muodollinen pätevyys","Aikuisten määrä","Ryhmän ikäluokat","Ryhmän koko","Vuorohoitoryhmä","Integroitu erityisryhmä","Osa-aikaiset lapset","Kommentti"]
[]
[]
[]
[]
[null,null,{"$f":"\"Ryhmä: \"&C15","v":"Ryhmä: "}]
[null,null,"Opettajan etunimi","Opettajan sukunimi","Opettajan henkilötunnus","Opettajan muodollinen pätevyys","Aikuisten määrä","Ryhmän ikäluokat","Ryhmän koko","Vuorohoitoryhmä","Integroitu erityisryhmä","Osa-aikaiset lapset","Kommentti"]
[]
[]
[]
[]
[null,null,{"$f":"\"Ryhmä: \"&C16","v":"Ryhmä: "}]
[null,null,"Opettajan etunimi","Opettajan sukunimi","Opettajan henkilötunnus","Opettajan muodollinen pätevyys","Aikuisten määrä","Ryhmän ikäluokat","Ryhmän koko","Vuorohoitoryhmä","Integroitu erityisryhmä","Osa-aikaiset lapset","Kommentti"]
[]
[]
[]
[]
[null,null,{"$f":"\"Ryhmä: \"&C17","v":"Ryhmä: "}]
[null,null,"Opettajan etunimi","Opettajan sukunimi","Opettajan henkilötunnus","Opettajan muodollinen pätevyys","Aikuisten määrä","Ryhmän ikäluokat","Ryhmän koko","Vuorohoitoryhmä","Integroitu erityisryhmä","Osa-aikaiset lapset","Kommentti"]
[]
[]
[]
[]
[null,null,{"$f":"\"Ryhmä: \"&C18","v":"Ryhmä: "}]
[null,null,"Opettajan etunimi","Opettajan sukunimi","Opettajan henkilötunnus","Opettajan muodollinen pätevyys","Aikuisten määrä","Ryhmän ikäluokat","Ryhmän koko","Vuorohoitoryhmä","Integroitu erityisryhmä","Osa-aikaiset lapset","Kommentti"]
[]
[]
[]
[]
[null,null,{"$f":"\"Ryhmä: \"&C19","v":"Ryhmä: "}]
[null,null,"Opettajan etunimi","Opettajan sukunimi","Opettajan henkilötunnus","Opettajan muodollinen pätevyys","Aikuisten määrä","Ryhmän ikäluokat","Ryhmän koko","Vuorohoitoryhmä","Integroitu erityisryhmä","Osa-aikaiset lapset","Kommentti"]
[]
[]
[]
[]
[null,null,{"$f":"\"Ryhmä: \"&C20","v":"Ryhmä: "}]
[null,null,"Opettajan etunimi","Opettajan sukunimi","Opettajan henkilötunnus","Opettajan muodollinen pätevyys","Aikuisten määrä","Ryhmän ikäluokat","Ryhmän koko","Vuorohoitoryhmä","Integroitu erityisryhmä","Osa-aikaiset lapset","Kommentti"]
[]
[]
[]
[]
[null,null,{"$f":"\"Ryhmä: \"&C21","v":"Ryhmä: "}]
[null,null,"Opettajan etunimi","Opettajan sukunimi","Opettajan henkilötunnus","Opettajan muodollinen pätevyys","Aikuisten määrä","Ryhmän ikäluokat","Ryhmän koko","Vuorohoitoryhmä","Integroitu erityisryhmä","Osa-aikaiset lapset","Kommentti"]
[]
[]
[]
[]
[null,null,{"$f":"\"Ryhmä: \"&C22","v":"Ryhmä: "}]
[null,null,"Opettajan etunimi","Opettajan sukunimi","Opettajan henkilötunnus","Opettajan muodollinen pätevyys","Aikuisten määrä","Ryhmän ikäluokat","Ryhmän koko","Vuorohoitoryhmä","Integroitu erityisryhmä","Osa-aikaiset lapset","Kommentti"]
[]
[]
[]
[]
[]
[null,null,"4. Lisää tarvittaessa puuttuvat ryhmät"]
[]
[null,null,"Ryhmän nimi","Opettajien lukumäärä ryhmässä"]
[]
[]
[]
[]
[]
[]
[null,null,{"$f":"\"Ryhmä: \"&C95","v":"Ryhmä: "}]
[null,null,"Opettajan etunimi","Opettajan sukunimi","Opettajan henkilötunnus","Opettajan muodollinen pätevyys","Aikuisten määrä","Ryhmän ikäluokat","Ryhmän koko","Vuorohoitoryhmä","Integroitu erityisryhmä","Osa-aikaiset lapset","Kommentti"]
[]
[]
[]
[]
[null,null,{"$f":"\"Ryhmä: \"&C96","v":"Ryhmä: "}]
[null,null,"Opettajan etunimi","Opettajan sukunimi","Opettajan henkilötunnus","Opettajan muodollinen pätevyys","Aikuisten määrä","Ryhmän ikäluokat","Ryhmän koko","Vuorohoitoryhmä","Integroitu erityisryhmä","Osa-aikaiset lapset","Kommentti"]
[]
[]
[]
[]
[null,null,{"$f":"\"Ryhmä: \"&C97","v":"Ryhmä: "}]
[null,null,"Opettajan etunimi","Opettajan sukunimi","Opettajan henkilötunnus","Opettajan muodollinen pätevyys","Aikuisten määrä","Ryhmän ikäluokat","Ryhmän koko","Vuorohoitoryhmä","Integroitu erityisryhmä","Osa-aikaiset lapset","Kommentti"]
[]
[]
[]
[]
[null,null,{"$f":"\"Ryhmä: \"&C98","v":"Ryhmä: "}]
[null,null,"Opettajan etunimi","Opettajan sukunimi","Opettajan henkilötunnus","Opettajan muodollinen pätevyys","Aikuisten määrä","Ryhmän ikäluokat","Ryhmän koko","Vuorohoitoryhmä","Integroitu erityisryhmä","Osa-aikaiset lapset","Kommentti"]
[]
[]
[]
[]
[null,null,{"$f":"\"Ryhmä: \"&C99","v":"Ryhmä: "}]
[null,null,"Opettajan etunimi","Opettajan sukunimi","Opettajan henkilötunnus","Opettajan muodollinen pätevyys","Aikuisten määrä","Ryhmän ikäluokat","Ryhmän koko","Vuorohoitoryhmä","Integroitu erityisryhmä","Osa-aikaiset lapset","Kommentti"]

{"sheet":"ryhmät","index":1,"n_rows":989,"n_cols":11,"rows_kept":989,"cut":false,"hidden":true,"merged":[]}
["toimipaikka","Ryhmä1","Ryhmä2","Ryhmä3","Ryhmä4","Ryhmä5","Ryhmä6","Ryhmä7","Ryhmä8","Ryhmä9","Ryhmä10"]
["Valitse tästä (alasvetovalikko)"]
["Alajärvi_Koulumäen päiväkoti_1.2.246.562.10.73647862728","Pörriäiset","Tuhatjalkaiset"]
["Alajärvi_Käpälämäen päiväkoti_1.2.246.562.10.91471881184","Kissanpennut"]
["Alajärvi_Myllyvainion päiväkoti_1.2.246.562.10.59396159408","Keltasirkut","Viherpeipot"]
["Alajärvi_Mäntymäen päiväkoti_1.2.246.562.10.97430034443","Harakat","Sudenpennut","Touhuryhmä"]
["Askola_Karpalo_1.2.246.562.10.11542620262","Kivipuro"]
["Askola_Puolukka_1.2.246.562.10.12140547832","Puolukka"]
["Askola_Sateenkaari_1.2.246.562.10.84463766695"]
["Askola_Tammenterho_1.2.246.562.10.45086106361","Karhunluola"]
["Aura_Kurki_1.2.246.562.10.67744782334","Metsätähdet"]
["Aura_Pääskynpesä_1.2.246.562.10.47571522680","Sinitiaiset"]
["Eura_Kauttuan päiväkoti_1.2.246.562.10.51502588422","Havut"]
["Eura_Päiväkoti euranrinkilä_1.2.246.562.10.95031038128","Apilat"]
["Eura_Päiväkoti pikkurinkilä_1.2.246.562.10.81680171527","Sudet"]
["Eurajoki_Päiväkoti kuunari_1.2.246.562.10.59954613663","Jungmannit"]
["Eurajoki_Päiväkoti majakka_1.2.246.562.10.11746154134","Hallit","Hylkeet","Norpat"]
["Eurajoki_Päiväkoti metsätähti_1.2.246.562.10.10820513678","Esikot","Karpalot"]
["Eurajoki_Päiväkoti skanssi_1.2.246.562.10.75748674316","Täkkärit"]
["Forssa_Koijärven koulu - päiväkoti_1.2.246.562.10.37873434718","Ilvekset"]
["Forssa_Kurjenpesän päiväkoti_1.2.246.562.10.56830822682","Lounatuulet","Poutapilvet","Revontulet","Sateenkaaret"]
["Forssa_Pihakoivun päiväkoti_1.2.246.562.10.35602583557","Peipposet","Satakielet"]
["Forssa_Päiväkoti augustina_1.2.246.562.10.54466083778","Kehrääjät","Värjärit"]
["Forssa_Päiväkoti axel wahren_1.2.246.562.10.48892803544","Oranssi","Punainen","Vihreät","Violetti"]
["Forssa_Taikatuulen päiväkoti_1.2.246.562.10.22528789567","Lounatuulet","Poutapilvet","Sateenkaaret"]
["Haapavesi_Ahjolan päiväkoti_1.2.246.562.10.94519274883","Naperot"]
["Haapavesi_Onnimannin päiväkoti_1.2.246.562.10.16257363388","Oravanmarjat"]
["Haapavesi_Pikku-martta_1.2.246.562.10.37379503297"]
["Haapavesi_Taikapuisto_1.2.246.562.10.81289780694","Ilvekset"]
["Hailuoto_Päiväkoti onnensaari_1.2.246.562.10.44766422834","Ainoa 5-vuotiaiden ryhmä"]
["Hamina_Neuvottoman päiväkoti_1.2.246.562.10.89073587613","Sinikellot"]
["Hamina_Pyhällön päiväkoti_1.2.246.562.10.48880875447","Ainoa 5-vuotiaiden ryhmä"]
["Hanko_Hangonkylän esikoulu / Hangöby förskola_1817","Majakat","Snäckorna"]
["Hanko_Hanko pohj päiväkoti hangö norra daghem_1.2.246.562.10.68952985619"]
["Hanko_Hyllis förskola_1818","Sälar"]
["Hanko_Lappohjan päiväkoti lappvik daghem_1.2.246.562.10.64284348758","Joutsenet"]
["Hanko_Metsämajan päiväkoti / skogshyddans daghem_1.2.246.562.10.57515002764","Menninkäiset"]
["Harjavalta_Joenrannan päiväkoti_1.2.246.562.10.33365920835","Keltaiset","Oranssit","Punaiset","Siniset"]
["Harjavalta_Vinnarin päiväkoti_1.2.246.562.10.28836561077","Kontiot"]
["Hattula_Päiväkoti marjahattu_1.2.246.562.10.53212375165","Metsämansikat","Metsämarjat","Puolukkapipot"]
["Hattula_Päiväkoti pappilanniemi_1.2.246.562.10.97481629166","Joutsenet","Metsälinnut","Pajulinnut","Satakielet","Satulinnut"]
["Hattula_Päiväkoti viiriäinen_1.2.246.562.10.56809087754","Hapsiaiset","Hilperit","Viikarit"]
["Heinola_Kettukallion päiväkoti_1.2.246.562.10.71153836425","Kuulaakso","Pilvipoukama"]
["Heinola_Sinilähteen päiväkoti_1.2.246.562.10.58740762941","Ainoa 5-vuotiaiden ryhmä"]
["Heinävesi_Päiväkoti päivänpesä_1.2.246.562.10.60042993083"]
["Helsinki_Dh domus_1.2.246.562.10.51663135583","Drakarna","Orangea drakarna"]
["Helsinki_Dh fenix_1.2.246.562.10.35275903363","Pelikaner","Tukaner"]
["Helsinki_Dh pilten_1.2.246.562.10.89466532549","Ekorrarna","Igelkottarna"]
["Helsinki_Dh rastis_1.2.246.562.10.99401692977","Stjärnorna"]
["Helsinki_Dh sesam_1.2.246.562.10.17173254438","Kompasser"]
["Helsinki_Dh sockenstugan_1.2.246.562.10.40535168757","Mymlorna"]
["Helsinki_Pk aapiskukko_1.2.246.562.10.92486247734","Aapola","Timola"]
["Helsinki_Pk alppikylä_1.2.246.562.10.15021121320","Kiitäjät","Loikkijat","Reissaajat","Vaeltajat"]
["Helsinki_Pk arabia_1.2.246.562.10.34792118159","Valmut","Versot"]
["Helsinki_Pk asteri_1.2.246.562.10.51372619737","Kehrääjät","Kimalaiset"]
["Helsinki_Pk auringonkukka_1.2.246.562.10.13837800922","Amiraalit"]
["Helsinki_Pk auringonpilkku_1.2.246.562.10.61185476068","Auringonsäteet"]
["Helsinki_Pk floora_1.2.246.562.10.22068160203","Kastanjakylän eskarit","Pähkinäkylän eskarit"]
["Helsinki_Pk havukka_1.2.246.562.10.40281031605","Havuset","Koalat","Oravat"]
["Helsinki_Pk herttoniemi_1.2.246.562.10.62334999703","Kotkat","Rastaat"]
["Helsinki_Pk herttua_1.2.246.562.10.27993565186","Mymmelit","Nipsut"]
["Helsinki_Pk himmeli_1.2.246.562.10.55774188647","Persikat","Punatulkut","Vihreät"]
["Helsinki_Pk ilomäki_1.2.246.562.10.36338788403","Merihevoset","Merisiilit"]
["Helsinki_Pk immola_1.2.246.562.10.37443064722","Haukat"]
["Helsinki_Pk impivaara_1.2.246.562.10.66845343160","Oravat"]
["Helsinki_Pk jaala_1.2.246.562.10.48838293487","Föörmannit ja laivurit","Seilorit"]
["Helsinki_Pk jousi_1.2.246.562.10.21620699872","Katajat","Pajut","Vaahterat"]
["Helsinki_Pk jäkälä_1.2.246.562.10.88757321851","Hillerit","Sopulit"]
["Helsinki_Pk jätkäsaari_1.2.246.562.10.18813410364"]
["Helsinki_Pk kalasatama_1.2.246.562.10.73508898316","Meduusat","Ruutanat","Silakat"]
["Helsinki_Pk kamomilla_1.2.246.562.10.67577951444","Ainoa 5-vuotiaiden ryhmä"]
["Helsinki_Pk kamppi_1.2.246.562.10.13391476812","Kankurit","Timpurit"]
["Helsinki_Pk kanava_1.2.246.562.10.35452178797","Aallot","Pyörteet","Pärskeet"]
["Helsinki_Pk kankarepuisto_1.2.246.562.10.70954292143","Mangustit","Ryhmä 6"]
["Helsinki_Pk karavaani_1.2.246.562.10.18002595389","Etsijät"]
["Helsinki_Pk kaskisavu_1.2.246.562.10.44201087531","Auringot","Kuunsäteet","Pisarat","Tähdet"]
["Helsinki_Pk katiska_1.2.246.562.10.67358449956","Mustekalat"]
["Helsinki_Pk keula_1.2.246.562.10.13052736017","Joutsenet","Pääskyt","Satakielet"]
["Helsinki_Pk kissankello_1.2.246.562.10.95308368992","Apilat","Esikot"]
["Helsinki_Pk kivelä_1.2.246.562.10.93389690152","Neilikat","Vanilja"]
["Helsinki_Pk kivilinna_1.2.246.562.10.33797778140","Soittoniekat"]
["Helsinki_Pk koralli_1.2.246.562.10.22213196045","Hippiäiset","Kultakalat","Ravut","Ulpukat"]
["Helsinki_Pk korento_1.2.246.562.10.32817247599","Kurjet","Sisiliskot","Teeret"]
["Helsinki_Pk kotikallio_1.2.246.562.10.81604110551","Pihlajat","Tammet"]
["Helsinki_Pk kotitorppa_1.2.246.562.10.75746681818","Kurjet"]
["Helsinki_Pk kulosaari_1.2.246.562.10.35318087166","Kääpiäiset","Sammaleiset"]
["Helsinki_Pk kurki_1.2.246.562.10.28614645118","Maahiset","Muusat"]
["Helsinki_Pk kurkimoisio_1.2.246.562.10.98928296916","Velhot"]
["Helsinki_Pk kylätie_1.2.246.562.10.90221393169","Kaskukulma","Riimiranta","Tarinatupa"]
["Helsinki_Pk kytöniitty_1.2.246.562.10.37019519562","Hepokatit","Muurahaiset"]
["Helsinki_Pk käpylinna_1.2.246.562.10.45334242489","Heinäsirkat","Hepokatit"]
["Helsinki_Pk lammikko_1.2.246.562.10.51327014984","Kaislat","Vehkat"]
["Helsinki_Pk lasten kartano_1.2.246.562.10.87675832312","Ampiaiset","Cobrat","Delfiinit"]
["Helsinki_Pk lauttasaari_1.2.246.562.10.61743228399","Hiirenhännät","Meriasterit"]
["Helsinki_Pk lehdokki_1.2.246.562.10.91141309624"]
["Helsinki_Pk lehtisaari_1.2.246.562.10.96181542158","Meritähdet"]
["Helsinki_Pk leppäsuo_1.2.246.562.10.54261863317","Hillat","Puolukat"]
["Helsinki_Pk leskenlehti_1.2.246.562.10.60903752149","Esiopetusryhmä"]
["Helsinki_Pk liinakko_1.2.246.562.10.66211791083","Pintelit"]
["Helsinki_Pk louhikko_1.2.246.562.10.44586233049","Nipsut"]
["Helsinki_Pk luotsi_1.2.246.562.10.57720369594"]
["Helsinki_Pk maarianmaa_1.2.246.562.10.88783529899","Ketut","Neulaset"]
["Helsinki_Pk marmori_1.2.246.562.10.60464386402","Hattivatit","Kissankäpälät","Korallit","Simpukat"]
["Helsinki_Pk maunula_1.2.246.562.10.22134518582","Mantelit","Muskotit","Nelikat","Pippurit"]
["Helsinki_Pk meri_1.2.246.562.10.33342968642","Miekkavalaat","Pasurit","Sinivalaat"]
["Helsinki_Pk merirasti_1.2.246.562.10.42033616451","Merileijonat"]
["Helsinki_Pk merituuli_1.2.246.562.10.25391495816","Meriharakat"]
["Helsinki_Pk mestari_1.2.246.562.10.22878883366","Nikkarit","Räätälit","Sorvarit","Suutarit"]
["Helsinki_Pk minttu_1.2.246.562.10.35071050278","Naalit","Saukot","Sudet"]
["Helsinki_Pk myllynratas_1.2.246.562.10.13434062066","Matkailijat","Retkeilijät"]
["Helsinki_Pk myllytonttu_1.2.246.562.10.90299364563","Metsäpeikot","Metsätontut","Pihatontut"]
["Helsinki_Pk nestori_1.2.246.562.10.41257724660","Otsot","Pellervot","Vellamot"]
["Helsinki_Pk neulanen_1.2.246.562.10.59307368791","Esiopetusryhmä a","Esiopetusryhmä c","Esiopetusryhmä d","Esiopetusryhmä h"]
["Helsinki_Pk norppa_1.2.246.562.10.58059815306","Meritähdet","Teeret"]
["Helsinki_Pk pacius_1.2.246.562.10.21931857417","Pajut","Täryt","Väkkärät"]
["Helsinki_Pk pajalahti_1.2.246.562.10.17082739719","Taikametsä","Viskari"]
["Helsinki_Pk pakila_1.2.246.562.10.44670830247"]
["Helsinki_Pk pehtoori_1.2.246.562.10.31929641392","Huuhkajat","Kivitaskut"]
["Helsinki_Pk pentinkulma_1.2.246.562.10.71869428913","Torppa"]
["Helsinki_Pk perttu_1.2.246.562.10.27919231442","Kissankulma","Vaahteramäki"]
["Helsinki_Pk pihlaja_1.2.246.562.10.10938622767","Korianterit","Pähkinät"]
["Helsinki_Pk pihlajamäki_1.2.246.562.10.33408424092","Revontulet","Salamat","Sateenkaaret","Tähdenlennot"]
["Helsinki_Pk pikku-veräjä_1.2.246.562.10.61890739917","Päiväperhoset"]
["Helsinki_Pk porolahti_1.2.246.562.10.88761479182","Majavat","Norpat"]
["Helsinki_Pk purje_1.2.246.562.10.96389294297"]
["Helsinki_Pk raitti_1.2.246.562.10.66848063161","Villiäiset","Väkkärät"]
["Helsinki_Pk roihuvuori_1.2.246.562.10.75906922457","Kaniner","Siilit/jänikset"]
["Helsinki_Pk ruoholahden lastentalo_1.2.246.562.10.73749830391","Maahiset"]
["Helsinki_Pk ruskeasuo_1.2.246.562.10.77233724853","Peipot","Svalorna"]
["Helsinki_Pk ruuti_1.2.246.562.10.24439126624","Kuunmuruset"]
["Helsinki_Pk rööperi_1.2.246.562.10.93061212598","Leijonat","Pikkukarhut"]
["Helsinki_Pk saana_1.2.246.562.10.83875239176","Halti","Kenestupa","Mukkavaara","Taivaskero","Vatikuru"]
["Helsinki_Pk sakara_1.2.246.562.10.66914054318","Keltasakarat","Punasakarat"]
["Helsinki_Pk sakarinmäki_1.2.246.562.10.73878963658","Metsäkarhut","Muurahaiset"]
["Helsinki_Pk saniainen_1.2.246.562.10.32620516602","Ihaat","Kengut"]
["Helsinki_Pk santahamina_1.2.246.562.10.41127393514","Leppäkertut","Muurahaiset"]
["Helsinki_Pk satakieli_1.2.246.562.10.18194214146","Tukaanit","Tähkä"]
["Helsinki_Pk satama_1.2.246.562.10.14913583531","Faanarit","Jäänmurtajat"]
["Helsinki_Pk satulinna_1.2.246.562.10.96546781566","Aamuruskot"]
["Helsinki_Pk savela_1.2.246.562.10.29877931377","Taatelit"]
["Helsinki_Pk seulanen_1.2.246.562.10.52384516911","Galaksit","Pyrstötähdet"]
["Helsinki_Pk siilitie_1.2.246.562.10.48496331249","Helmipöllöt","Jänikset","Ketut"]
["Helsinki_Pk sinivuori_1.2.246.562.10.26064057230","Hattivatit","Hobitit"]
["Helsinki_Pk tahvonlahti_1.2.246.562.10.92818775329","Metsäjänikset","Punaiset"]
["Helsinki_Pk tammi_1.2.246.562.10.29229090682","Omenatarha","Roskut"]
["Helsinki_Pk tammisalo_1.2.246.562.10.43276597283"]
["Helsinki_Pk tapanila_1.2.246.562.10.51778278922","Kastehelmet","Puhurit","Sateenkaaret"]
["Helsinki_Pk tilhi_1.2.246.562.10.35754276216","Leivoset","Peukaloiset"]
["Helsinki_Pk toivo_1.2.246.562.10.53885788199","Korallit","Rubiinit/hurrikaanit","Rubiinit/tornadot"]
["Helsinki_Pk torpparinmäki_1.2.246.562.10.12124722682","Kurjet"]
["Helsinki_Pk tuorinniemi_1.2.246.562.10.67990627290","Kalat","Norpat"]
["Helsinki_Pk tuuli_1.2.246.562.10.61322467251","Tuulimylly","Tuuliviiri"]
["Helsinki_Pk vaapukka_1.2.246.562.10.35987280753","Auringonlaskut","Hurrikaanit","Merituulet","Pyrstötähdet","Revontulet","Sateenkaaret","Tuulenpuuskat","Vesipisarat"]
["Helsinki_Pk valkea_1.2.246.562.10.84628698353","Metsätiuhdit"]
["Helsinki_Pk vallesmanni_1.2.246.562.10.14380102070","Lukkarit","Räätälit"]
["Helsinki_Pk vaskiniitty_1.2.246.562.10.48535115959","Amiraalit"]
["Helsinki_Pk viikinki_1.2.246.562.10.48826493719","Tuuloset","Vihurit","Vimpulat"]
["Helsinki_Pk vikkeri_1.2.246.562.10.53445112484","Pilvenhattara","Pohjantähti","Päivänpaiste"]
["Helsinki_Pk virkkula_1.2.246.562.10.53388264961","Huvikumpu"]
["Helsinki_Pk viskuri_1.2.246.562.10.81878341650","Ohrat","Rukiit"]
["Helsinki_Pk yliskylä_1.2.246.562.10.31037743676","Helmipöllöt","Hopeatäplät","Kultasiivet","Käpytikat","Puukiipijät"]
["Helsinki_Pk ylä-malmi_1.2.246.562.10.28393933768","Poliisit","Sateenkaarisydämet"]
["Huittinen_Huvikummun päiväkoti_1.2.246.562.10.76921761367","Heikun keikun"]
["Huittinen_Kuninkaisten päiväkoti_1.2.246.562.10.71251332806","Viskarit"]
["Huittinen_Vampulan päiväkoti_1.2.246.562.10.93404087830","Unikot"]
["Humppila_Päiväkoti päivänpaiste_1.2.246.562.10.56464540402","Viikarit"]
["Hämeenlinna_Eteläisten päiväkoti_1.2.246.562.10.32986349028","Hahtuvat","Helmiäiset","Untuvat"]
["Hämeenlinna_Hattelmalan päiväkoti_1.2.246.562.10.65604628613","Hulivilit"]
["Hämeenlinna_Hirsimäen päiväkoti_1.2.246.562.10.85501065636","Heinähatut","Metsänhaltiat","Naavaparrat","Tuohitossut"]
["Hämeenlinna_Iittalan päiväkoti_1.2.246.562.10.20138852296","Kaarnat","Kaislat","Kastehelmet","Kimarat","Kuurat"]
["Hämeenlinna_Jaarlin päiväkodit tarvasmäki_1.2.246.562.10.14758576384","Kärrynpyörät","Viskarit"]
["Hämeenlinna_Jaarlin päiväkoti enkkula_1.2.246.562.10.89982950779"]
["Hämeenlinna_Jaarlin päiväkoti poltinaho_1.2.246.562.10.96905860332","Ceejappi","Deejappi","Metsot"]
["Hämeenlinna_Jukola_1.2.246.562.10.98524109786","Loikkalaamat"]
["Hämeenlinna_Kaivokadun päiväkoti_1.2.246.562.10.46668411146","Hapsuhännät","Sammaltossut"]
["Hämeenlinna_Kankaantaan päiväkoti_1.2.246.562.10.72182255132","Kontiot","Otsot"]
["Hämeenlinna_Karhuryhmän päiväkoti_1.2.246.562.10.15860224417","Karhuryhmä"]
["Hämeenlinna_Katuman päiväkoti_1.2.246.562.10.67050425551","Metsänväki"]
["Hämeenlinna_Kutalan päiväkoti_1.2.246.562.10.53618091986","Aittatontut","Hiirenvirnat","Kaislat","Kotitontut","Metsätontut","Myllytontut","Pihatontut","Riihitontut","Sinivuokot","Ulpukat"]
["Hämeenlinna_Lammin päiväkoti_1.2.246.562.10.32750401542","Hiippalakit","Pellavaiset"]
["Hämeenlinna_Liivuoren päiväkoti_1.2.246.562.10.64971949249","Impivaara","Männistö","Toukola","Viertola"]
["Hämeenlinna_Melukylän päiväkoti_1.2.246.562.10.11458273411","Välitalo"]
["Hämeenlinna_Ojoisten päiväkoti_1.2.246.562.10.11250727648","Revontulet"]
["Hämeenlinna_Planeetta_1.2.246.562.10.21399423223","Hurrikaanit"]
["Hämeenlinna_Rengon päiväkoti_1.2.246.562.10.88847851420","Ilvestupsut","Ketunhännät","Metsäilvekset","Otsot"]
["Hämeenlinna_Solvikin päiväkoti_1.2.246.562.10.78994360754","Maahiset","Mettiset","Myttyset","Vetehiset"]
["Ii_Alarannan päiväkoti_1.2.246.562.10.77030968877","Lumpeet"]
["Ii_Haminan päiväkoti_1.2.246.562.10.24770302867","Vanamot"]
["Ii_Harjuntähden päiväkoti_1.2.246.562.10.24578412132"]
["Ii_Kuivaniemen päiväkoti_1.2.246.562.10.10790743891","Ainoa 5-vuotiaiden ryhmä"]
["Ii_Lakson päiväkoti_1.2.246.562.10.14318544872","Mustikat"]
["Ii_Nikkarin päiväkoti_1.2.246.562.10.60061548024","Nuppuset","Peikkoset","Soraset"]
["Ii_Päiväkoti ida valpuri_1.2.246.562.10.16881353359"]
["Ii_Päiväkoti tikkaset_1.2.246.562.10.87464405395","Pääskyset"]
["Iitti_Peltohiiren päiväkoti_1.2.246.562.10.36496140736","Peipot"]
["Iitti_Päiväkoti nuppula_1.2.246.562.10.47502279723","Vanamot"]
["Iitti_Päiväkoti pikku-vieteri_1.2.246.562.10.86985378321","Ketunleivät","Kurjenpolvet"]
["Ikaalinen_Kakkospesä_1.2.246.562.10.93227011801","Hopeatäplät","Kultasiivet"]
["Ikaalinen_Kilvakkala_1.2.246.562.10.88294474726","Kuusipirtin viskarit"]
["Ikaalinen_Valkean ruusun päiväkoti_1.2.246.562.10.30952868484","Ainoa 5-vuotiaiden ryhmä"]
{"$rows_left_out":789}